Target
Urotensin-2 receptor
Ligand
BDBM50302242
Substrate
Meas. Tech.
ChEMBL_596665 (CHEMBL1048827)
IC50
69±n/a nM
Citation
 Lawson, ECLuci, DKGhosh, SKinney, WAReynolds, CHQi, JSmith, CEWang, YMinor, LKHaertlein, BJParry, TJDamiano, BPMaryanoff, BE Nonpeptide urotensin-II receptor antagonists: a new ligand class based on piperazino-phthalimide and piperazino-isoindolinone subunits. J Med Chem 52:7432-45 (2009)  
Target
Name:
Urotensin-2 receptor
Synonyms:
G-protein coupled receptor 14 Gpr14 UR-II-R Urotensin-II | Uts2r
Type:
Enzyme Catalytic Domain
Mol. Mass.:
42725.34
Organism:
RAT
Description:
Urotensin-II UTS2R RAT::P49684
Residue:
386
  
Inhibitor
Name:
BDBM50302242
Synonyms:
CHEMBL565580 | N-((S)-4-(3,4-dimethoxyphenyl)-4-(1,3-dioxo-4-(4-((R)-1-phenylethyl)piperazin-1-yl)isoindolin-2-yl)butyl)thiophene-2-sulfonamide
Type:
Small organic molecule
Emp. Form.:
C36H40N4O6S2
Mol. Mass.:
688.856
SMILES:
COc1ccc(cc1OC)[C@H](CCCNS(=O)(=O)c1cccs1)N1C(=O)c2cccc(N3CCN(CC3)[C@H](C)c3ccccc3)c2C1=O
: