Target
Urotensin-2 receptor
Ligand
BDBM50302249
Substrate
Meas. Tech.
ChEMBL_596665 (CHEMBL1048827)
IC50
4.8±n/a nM
Citation
 Lawson, ECLuci, DKGhosh, SKinney, WAReynolds, CHQi, JSmith, CEWang, YMinor, LKHaertlein, BJParry, TJDamiano, BPMaryanoff, BE Nonpeptide urotensin-II receptor antagonists: a new ligand class based on piperazino-phthalimide and piperazino-isoindolinone subunits. J Med Chem 52:7432-45 (2009)  
Target
Name:
Urotensin-2 receptor
Synonyms:
G-protein coupled receptor 14 Gpr14 UR-II-R Urotensin-II | Uts2r
Type:
Enzyme Catalytic Domain
Mol. Mass.:
42725.34
Organism:
RAT
Description:
Urotensin-II UTS2R RAT::P49684
Residue:
386
  
Inhibitor
Name:
BDBM50302249
Synonyms:
(R)-N-(4-(3,4-dimethoxyphenyl)-4-(4-(4-ethylpiperazin-1-yl)-1,3-dioxoisoindolin-2-yl)butyl)thiophene-2-sulfonamide | CHEMBL566433
Type:
Small organic molecule
Emp. Form.:
C30H36N4O6S2
Mol. Mass.:
612.76
SMILES:
CCN1CCN(CC1)c1cccc2C(=O)N([C@H](CCCNS(=O)(=O)c3cccs3)c3ccc(OC)c(OC)c3)C(=O)c12
: