Target
Urotensin-2 receptor
Ligand
BDBM50302260
Substrate
Meas. Tech.
ChEMBL_596665 (CHEMBL1048827)
IC50
6±n/a nM
Citation
 Lawson, ECLuci, DKGhosh, SKinney, WAReynolds, CHQi, JSmith, CEWang, YMinor, LKHaertlein, BJParry, TJDamiano, BPMaryanoff, BE Nonpeptide urotensin-II receptor antagonists: a new ligand class based on piperazino-phthalimide and piperazino-isoindolinone subunits. J Med Chem 52:7432-45 (2009)  
Target
Name:
Urotensin-2 receptor
Synonyms:
G-protein coupled receptor 14 Gpr14 UR-II-R Urotensin-II | Uts2r
Type:
Enzyme Catalytic Domain
Mol. Mass.:
42725.34
Organism:
RAT
Description:
Urotensin-II UTS2R RAT::P49684
Residue:
386
  
Inhibitor
Name:
BDBM50302260
Synonyms:
(R)-2-(1-(3,4-dimethoxyphenyl)-4-(thiophen-2-ylmethylamino)butyl)-4-(4-ethylpiperazin-1-yl)isoindolin-1-one | CHEMBL568123
Type:
Small organic molecule
Emp. Form.:
C31H40N4O3S
Mol. Mass.:
548.739
SMILES:
CCN1CCN(CC1)c1cccc2C(=O)N(Cc12)[C@H](CCCNCc1cccs1)c1ccc(OC)c(OC)c1
: