Target
Urotensin-2 receptor
Ligand
BDBM50302263
Substrate
Meas. Tech.
ChEMBL_596665 (CHEMBL1048827)
IC50
16±n/a nM
Citation
 Lawson, ECLuci, DKGhosh, SKinney, WAReynolds, CHQi, JSmith, CEWang, YMinor, LKHaertlein, BJParry, TJDamiano, BPMaryanoff, BE Nonpeptide urotensin-II receptor antagonists: a new ligand class based on piperazino-phthalimide and piperazino-isoindolinone subunits. J Med Chem 52:7432-45 (2009)  
Target
Name:
Urotensin-2 receptor
Synonyms:
G-protein coupled receptor 14 Gpr14 UR-II-R Urotensin-II | Uts2r
Type:
Enzyme Catalytic Domain
Mol. Mass.:
42725.34
Organism:
RAT
Description:
Urotensin-II UTS2R RAT::P49684
Residue:
386
  
Inhibitor
Name:
BDBM50302263
Synonyms:
(R)-N-(4-(3,4-dimethoxyphenyl)-4-(4-(4-methylpiperazin-1-yl)-1-oxoisoindolin-2-yl)butyl)-N-methylthiophene-2-sulfonamide | CHEMBL571216
Type:
Small organic molecule
Emp. Form.:
C30H38N4O5S2
Mol. Mass.:
598.777
SMILES:
COc1ccc(cc1OC)[C@@H](CCCN(C)S(=O)(=O)c1cccs1)N1Cc2c(cccc2N2CCN(C)CC2)C1=O
: