Target
Urotensin-2 receptor
Ligand
BDBM50302268
Substrate
Meas. Tech.
ChEMBL_596665 (CHEMBL1048827)
IC50
6±n/a nM
Citation
 Lawson, ECLuci, DKGhosh, SKinney, WAReynolds, CHQi, JSmith, CEWang, YMinor, LKHaertlein, BJParry, TJDamiano, BPMaryanoff, BE Nonpeptide urotensin-II receptor antagonists: a new ligand class based on piperazino-phthalimide and piperazino-isoindolinone subunits. J Med Chem 52:7432-45 (2009)  
Target
Name:
Urotensin-2 receptor
Synonyms:
G-protein coupled receptor 14 Gpr14 UR-II-R Urotensin-II | Uts2r
Type:
Enzyme Catalytic Domain
Mol. Mass.:
42725.34
Organism:
RAT
Description:
Urotensin-II UTS2R RAT::P49684
Residue:
386
  
Inhibitor
Name:
BDBM50302268
Synonyms:
CHEMBL578206 | N-((R)-4-(3,4-dimethoxyphenyl)-4-(1-oxo-4-(4-((R)-1-phenylethyl)piperazin-1-yl)isoindolin-2-yl)butyl)-5-methylisoxazole-4-carboxamide
Type:
Small organic molecule
Emp. Form.:
C37H43N5O5
Mol. Mass.:
637.7678
SMILES:
COc1ccc(cc1OC)[C@@H](CCCNC(=O)c1cnoc1C)N1Cc2c(cccc2N2CCN(CC2)[C@H](C)c2ccccc2)C1=O
: