Target
Urotensin-2 receptor
Ligand
BDBM50302236
Substrate
Meas. Tech.
ChEMBL_596666 (CHEMBL1048828)
Ki
290±n/a nM
Citation
 Lawson, ECLuci, DKGhosh, SKinney, WAReynolds, CHQi, JSmith, CEWang, YMinor, LKHaertlein, BJParry, TJDamiano, BPMaryanoff, BE Nonpeptide urotensin-II receptor antagonists: a new ligand class based on piperazino-phthalimide and piperazino-isoindolinone subunits. J Med Chem 52:7432-45 (2009)  
Target
Name:
Urotensin-2 receptor
Synonyms:
G-protein coupled receptor 14 UR-II-R UTS2R Urotensin-II
Type:
Enzyme Catalytic Domain
Mol. Mass.:
42159.71
Organism:
Homo sapiens (Human)
Description:
Urotensin-II UTS2R HUMAN::Q9UKP6
Residue:
389
  
Inhibitor
Name:
BDBM50302236
Synonyms:
CHEMBL569238 | N-(2-(3,4-dimethoxyphenyl)-2-(1,3-dioxo-4-(4-((S)-1-phenylethyl)piperazin-1-yl)isoindolin-2-yl)ethyl)thiophene-2-sulfonamide
Type:
Small organic molecule
Emp. Form.:
C34H36N4O6S2
Mol. Mass.:
660.803
SMILES:
COc1ccc(cc1OC)C(CNS(=O)(=O)c1cccs1)N1C(=O)c2cccc(N3CCN(CC3)[C@@H](C)c3ccccc3)c2C1=O
: