Target
Urotensin-2 receptor
Ligand
BDBM50302237
Substrate
Meas. Tech.
ChEMBL_596666 (CHEMBL1048828)
Ki
540±n/a nM
Citation
 Lawson, ECLuci, DKGhosh, SKinney, WAReynolds, CHQi, JSmith, CEWang, YMinor, LKHaertlein, BJParry, TJDamiano, BPMaryanoff, BE Nonpeptide urotensin-II receptor antagonists: a new ligand class based on piperazino-phthalimide and piperazino-isoindolinone subunits. J Med Chem 52:7432-45 (2009)  
Target
Name:
Urotensin-2 receptor
Synonyms:
G-protein coupled receptor 14 UR-II-R UTS2R Urotensin-II
Type:
Enzyme Catalytic Domain
Mol. Mass.:
42159.71
Organism:
Homo sapiens (Human)
Description:
Urotensin-II UTS2R HUMAN::Q9UKP6
Residue:
389
  
Inhibitor
Name:
BDBM50302237
Synonyms:
CHEMBL568089 | tert-butyl 3-(3,4-dimethoxyphenyl)-3-(1,3-dioxo-4-(4-((S)-1-phenylethyl)piperazin-1-yl)isoindolin-2-yl)propylcarbamate
Type:
Small organic molecule
Emp. Form.:
C36H44N4O6
Mol. Mass.:
628.7578
SMILES:
COc1ccc(cc1OC)C(CCNC(=O)OC(C)(C)C)N1C(=O)c2cccc(N3CCN(CC3)[C@@H](C)c3ccccc3)c2C1=O
: