Target
Urotensin-2 receptor
Ligand
BDBM50302267
Substrate
Meas. Tech.
ChEMBL_596666 (CHEMBL1048828)
Ki
11±n/a nM
Citation
 Lawson, ECLuci, DKGhosh, SKinney, WAReynolds, CHQi, JSmith, CEWang, YMinor, LKHaertlein, BJParry, TJDamiano, BPMaryanoff, BE Nonpeptide urotensin-II receptor antagonists: a new ligand class based on piperazino-phthalimide and piperazino-isoindolinone subunits. J Med Chem 52:7432-45 (2009)  
Target
Name:
Urotensin-2 receptor
Synonyms:
G-protein coupled receptor 14 UR-II-R UTS2R Urotensin-II
Type:
Enzyme Catalytic Domain
Mol. Mass.:
42159.71
Organism:
Homo sapiens (Human)
Description:
Urotensin-II UTS2R HUMAN::Q9UKP6
Residue:
389
  
Inhibitor
Name:
BDBM50302267
Synonyms:
(R)-N-(4-(3,4-dimethoxyphenyl)-4-(4-(4-ethylpiperazin-1-yl)-1-oxoisoindolin-2-yl)butyl)-3,5-dimethyl-1H-pyrazole-4-carboxamide | CHEMBL578205
Type:
Small organic molecule
Emp. Form.:
C32H42N6O4
Mol. Mass.:
574.7137
SMILES:
CCN1CCN(CC1)c1cccc2C(=O)N(Cc12)[C@H](CCCNC(=O)c1c(C)n[nH]c1C)c1ccc(OC)c(OC)c1
: