Target
Urotensin-2 receptor
Ligand
BDBM50302271
Substrate
Meas. Tech.
ChEMBL_596666 (CHEMBL1048828)
Ki
8±n/a nM
Citation
 Lawson, ECLuci, DKGhosh, SKinney, WAReynolds, CHQi, JSmith, CEWang, YMinor, LKHaertlein, BJParry, TJDamiano, BPMaryanoff, BE Nonpeptide urotensin-II receptor antagonists: a new ligand class based on piperazino-phthalimide and piperazino-isoindolinone subunits. J Med Chem 52:7432-45 (2009)  
Target
Name:
Urotensin-2 receptor
Synonyms:
G-protein coupled receptor 14 UR-II-R UTS2R Urotensin-II
Type:
Enzyme Catalytic Domain
Mol. Mass.:
42159.71
Organism:
Homo sapiens (Human)
Description:
Urotensin-II UTS2R HUMAN::Q9UKP6
Residue:
389
  
Inhibitor
Name:
BDBM50302271
Synonyms:
(R)-2-(1-(3,4-dimethoxyphenyl)-4-(6-methoxypyrazin-2-ylamino)butyl)-4-(4-ethylpiperazin-1-yl)isoindolin-1-one | CHEMBL571625
Type:
Small organic molecule
Emp. Form.:
C31H40N6O4
Mol. Mass.:
560.6871
SMILES:
CCN1CCN(CC1)c1cccc2C(=O)N(Cc12)[C@H](CCCNc1cncc(OC)n1)c1ccc(OC)c(OC)c1
: