Target
Urotensin-2 receptor
Ligand
BDBM50302264
Substrate
Meas. Tech.
ChEMBL_596667 (CHEMBL1048829)
IC50
500±n/a nM
Citation
 Lawson, ECLuci, DKGhosh, SKinney, WAReynolds, CHQi, JSmith, CEWang, YMinor, LKHaertlein, BJParry, TJDamiano, BPMaryanoff, BE Nonpeptide urotensin-II receptor antagonists: a new ligand class based on piperazino-phthalimide and piperazino-isoindolinone subunits. J Med Chem 52:7432-45 (2009)  
Target
Name:
Urotensin-2 receptor
Synonyms:
G-protein coupled receptor 14 UR-II-R UTS2R Urotensin-II
Type:
Enzyme Catalytic Domain
Mol. Mass.:
42159.71
Organism:
Homo sapiens (Human)
Description:
Urotensin-II UTS2R HUMAN::Q9UKP6
Residue:
389
  
Inhibitor
Name:
BDBM50302264
Synonyms:
(R)-N-(4-(3,4-dimethoxyphenyl)-4-(4-(4-isopropylpiperazin-1-yl)-1-oxoisoindolin-2-yl)butyl)-N-methylthiophene-2-sulfonamide | CHEMBL578203
Type:
Small organic molecule
Emp. Form.:
C32H42N4O5S2
Mol. Mass.:
626.83
SMILES:
COc1ccc(cc1OC)[C@@H](CCCN(C)S(=O)(=O)c1cccs1)N1Cc2c(cccc2N2CCN(CC2)C(C)C)C1=O
: