Target
Acetyl-CoA carboxylase 1
Ligand
BDBM50302355
Substrate
Meas. Tech.
ChEMBL_596937 (CHEMBL1048878)
IC50
16±n/a nM
Citation
 Haque, TSLiang, NGolla, RSeethala, RMa, ZEwing, WRCooper, CBPelleymounter, MAPoss, MACheng, D Potent biphenyl- and 3-phenyl pyridine-based inhibitors of acetyl-CoA carboxylase. Bioorg Med Chem Lett 19:5872-6 (2009)  
Target
Name:
Acetyl-CoA carboxylase 1
Synonyms:
ACAC ACACA_HUMAN ACC1 Acetyl-CoA carboxylase 1 | Acetyl-CoA carboxylase 1 (ACC1)
Type:
Protein
Mol. Mass.:
265543.22
Organism:
Homo sapiens (Human)
Description:
Q13085
Residue:
2346
  
Inhibitor
Name:
BDBM50302355
Synonyms:
CHEMBL565818 | N-(1-(4'-(4-isopropoxyphenoxy)-2'-methylbiphenyl-4-yl)ethyl)acetamide
Type:
Small organic molecule
Emp. Form.:
C26H29NO3
Mol. Mass.:
403.5134
SMILES:
CC(C)Oc1ccc(Oc2ccc(c(C)c2)-c2ccc(cc2)C(C)NC(C)=O)cc1
: