Target
Corticotropin-releasing factor receptor 1
Ligand
BDBM50302574
Substrate
Meas. Tech.
ChEMBL_594612 (CHEMBL1037909)
Ki
9±n/a nM
Citation
 Miller, DCKlute, WCalabrese, ABrown, AD Optimising metabolic stability in lipophilic chemical space: the identification of a metabolically stable pyrazolopyrimidine CRF-1 receptor antagonist. Bioorg Med Chem Lett 19:6144-7 (2009)  
Target
Name:
Corticotropin-releasing factor receptor 1
Synonyms:
CRF-R CRF1 CRFR1 CRH-R 1 CRHR1 Corticotropin-releasing factor receptor 1 (CRF-1) Corticotropin-releasing hormone receptor 1
Type:
Enzyme
Mol. Mass.:
50744.31
Organism:
Homo sapiens (Human)
Description:
P34998
Residue:
444
  
Inhibitor
Name:
BDBM50302574
Synonyms:
CHEMBL576049 | N-butyl-N-ethyl-1-mesityl-3,6-dimethyl-1H-pyrazolo[3,4-d]pyrimidin-4-amine
Type:
Small organic molecule
Emp. Form.:
C22H31N5
Mol. Mass.:
365.515
SMILES:
CCCCN(CC)c1nc(C)nc2n(nc(C)c12)-c1c(C)cc(C)cc1C
: