Target
Corticotropin-releasing factor receptor 1
Ligand
BDBM50302580
Substrate
Meas. Tech.
ChEMBL_594612 (CHEMBL1037909)
Ki
1130±n/a nM
Citation
 Miller, DCKlute, WCalabrese, ABrown, AD Optimising metabolic stability in lipophilic chemical space: the identification of a metabolically stable pyrazolopyrimidine CRF-1 receptor antagonist. Bioorg Med Chem Lett 19:6144-7 (2009)  
Target
Name:
Corticotropin-releasing factor receptor 1
Synonyms:
CRF-R CRF1 CRFR1 CRH-R 1 CRHR1 Corticotropin-releasing factor receptor 1 (CRF-1) Corticotropin-releasing hormone receptor 1
Type:
Enzyme
Mol. Mass.:
50744.31
Organism:
Homo sapiens (Human)
Description:
P34998
Residue:
444
  
Inhibitor
Name:
BDBM50302580
Synonyms:
(2R)-2-(1-(4-methoxy-2-methylphenyl)-3,6-dimethyl-1H-pyrazolo[3,4-d]pyrimidin-4-ylamino)butan-1-ol | CHEMBL566939
Type:
Small organic molecule
Emp. Form.:
C19H25N5O2
Mol. Mass.:
355.4341
SMILES:
CC[C@H](CO)Nc1nc(C)nc2n(nc(C)c12)-c1ccc(OC)cc1C
: