Target
Corticotropin-releasing factor receptor 1
Ligand
BDBM50302588
Substrate
Meas. Tech.
ChEMBL_594612 (CHEMBL1037909)
Ki
996±n/a nM
Citation
 Miller, DCKlute, WCalabrese, ABrown, AD Optimising metabolic stability in lipophilic chemical space: the identification of a metabolically stable pyrazolopyrimidine CRF-1 receptor antagonist. Bioorg Med Chem Lett 19:6144-7 (2009)  
Target
Name:
Corticotropin-releasing factor receptor 1
Synonyms:
CRF-R CRF1 CRFR1 CRH-R 1 CRHR1 Corticotropin-releasing factor receptor 1 (CRF-1) Corticotropin-releasing hormone receptor 1
Type:
Enzyme
Mol. Mass.:
50744.31
Organism:
Homo sapiens (Human)
Description:
P34998
Residue:
444
  
Inhibitor
Name:
BDBM50302588
Synonyms:
CHEMBL568607 | N-(1-(4-methoxy-2-methylphenyl)-3,6-dimethyl-1H-pyrazolo[3,4-d]pyrimidin-4-yl)-5-((propylamino)methyl)-1,3,4-oxadiazol-2-amine
Type:
Small organic molecule
Emp. Form.:
C21H26N8O2
Mol. Mass.:
422.4835
SMILES:
CCCNCc1nnc(Nc2nc(C)nc3n(nc(C)c23)-c2ccc(OC)cc2C)o1
: