Target
Corticotropin-releasing factor receptor 1
Ligand
BDBM50302594
Substrate
Meas. Tech.
ChEMBL_594612 (CHEMBL1037909)
Ki
74±n/a nM
Citation
 Miller, DCKlute, WCalabrese, ABrown, AD Optimising metabolic stability in lipophilic chemical space: the identification of a metabolically stable pyrazolopyrimidine CRF-1 receptor antagonist. Bioorg Med Chem Lett 19:6144-7 (2009)  
Target
Name:
Corticotropin-releasing factor receptor 1
Synonyms:
CRF-R CRF1 CRFR1 CRH-R 1 CRHR1 Corticotropin-releasing factor receptor 1 (CRF-1) Corticotropin-releasing hormone receptor 1
Type:
Enzyme
Mol. Mass.:
50744.31
Organism:
Homo sapiens (Human)
Description:
P34998
Residue:
444
  
Inhibitor
Name:
BDBM50302594
Synonyms:
1-(2,4-dimethoxyphenyl)-N-(2-methoxyethyl)-3,6-dimethyl-N-propyl-1H-pyrazolo[3,4-d]pyrimidin-4-amine | CHEMBL583237
Type:
Small organic molecule
Emp. Form.:
C21H29N5O3
Mol. Mass.:
399.4867
SMILES:
CCCN(CCOC)c1nc(C)nc2n(nc(C)c12)-c1ccc(OC)cc1OC
: