Target
Delta-type opioid receptor
Ligand
BDBM50302774
Substrate
Meas. Tech.
ChEMBL_595266 (CHEMBL1043618)
Ki
18±n/a nM
Citation
 Jones, PGriffin, AMGawell, LLavoie, RDelorme, DRoberts, EBrown, WWalpole, CXiao, WBoulet, JLabarre, MCoupal, MButterworth, JSt-Onge, SHodzic, LSalois, D N,N-Diethyl-4-[(3-hydroxyphenyl)(piperidin-4-yl)amino] benzamide derivatives: the development of diaryl amino piperidines as potent delta opioid receptor agonists with in vivo anti-nociceptive activity in rodent models. Bioorg Med Chem Lett 19:5994-8 (2009)  
Target
Name:
Delta-type opioid receptor
Synonyms:
D-OR-1 Delta opioid receptor OPIATE Delta OPRD1 OPRK1 | opioid receptor, delta 1
Type:
G Protein-Coupled Receptor (GPCR)
Mol. Mass.:
40382.98
Organism:
Homo sapiens (Human)
Description:
Competition binding assays were carried out using membrane preparations from transfected HN9.10 cells that constitutively expressed the delta opioid receptor.
Residue:
372
  
Inhibitor
Name:
BDBM50302774
Synonyms:
CHEMBL569945 | N,N-diethyl-4-((3-methoxyphenyl)(1-(2-(thiophen-3-yl)ethyl)piperidin-4-yl)amino)benzamide
Type:
Small organic molecule
Emp. Form.:
C29H37N3O2S
Mol. Mass.:
491.688
SMILES:
CCN(CC)C(=O)c1ccc(cc1)N(C1CCN(CCc2ccsc2)CC1)c1cccc(OC)c1
: