Target
Sodium/glucose cotransporter 1
Ligand
BDBM50303242
Substrate
Meas. Tech.
ChEMBL_595351 (CHEMBL1050644)
IC50
200±n/a nM
Citation
 Lv, BXu, BFeng, YPeng, KXu, GDu, JZhang, LZhang, WZhang, TZhu, LDing, HSheng, ZWelihinda, ASeed, BChen, Y Exploration of O-spiroketal C-arylglucosides as novel and selective renal sodium-dependent glucose co-transporter 2 (SGLT2) inhibitors. Bioorg Med Chem Lett 19:6877-81 (2009)  
Target
Name:
Sodium/glucose cotransporter 1
Synonyms:
High affinity sodium-glucose cotransporter Na(+)/glucose cotransporter 1 SGLT1 Sodium-dependent glucose cotransporter 1 (SGLT1) Sodium/glucose cotransporter 1 (SGLT1) | Solute carrier family 5 member 1
Type:
Protein
Mol. Mass.:
73503.78
Organism:
Homo sapiens (Human)
Description:
P13866
Residue:
664
  
Inhibitor
Name:
BDBM50303242
Synonyms:
(1S,3'R,4'S,5'S,6'R)-5-chloro-6'-(hydroxymethyl)-6-(4-methoxybenzyl)-3',4',5',6'-tetrahydro-3H-spiro[isobenzofuran-1,2'-pyran]-3',4',5'-triol | CHEMBL585477
Type:
Small organic molecule
Emp. Form.:
C21H23ClO7
Mol. Mass.:
422.856
SMILES:
COc1ccc(Cc2cc3c(CO[C@]33O[C@H](CO)[C@@H](O)[C@H](O)[C@H]3O)cc2Cl)cc1
: