Target
Sodium/glucose cotransporter 1
Ligand
BDBM50303252
Substrate
Meas. Tech.
ChEMBL_595351 (CHEMBL1050644)
IC50
1000±n/a nM
Citation
 Lv, BXu, BFeng, YPeng, KXu, GDu, JZhang, LZhang, WZhang, TZhu, LDing, HSheng, ZWelihinda, ASeed, BChen, Y Exploration of O-spiroketal C-arylglucosides as novel and selective renal sodium-dependent glucose co-transporter 2 (SGLT2) inhibitors. Bioorg Med Chem Lett 19:6877-81 (2009)  
Target
Name:
Sodium/glucose cotransporter 1
Synonyms:
High affinity sodium-glucose cotransporter Na(+)/glucose cotransporter 1 SGLT1 Sodium-dependent glucose cotransporter 1 (SGLT1) Sodium/glucose cotransporter 1 (SGLT1) | Solute carrier family 5 member 1
Type:
Protein
Mol. Mass.:
73503.78
Organism:
Homo sapiens (Human)
Description:
P13866
Residue:
664
  
Inhibitor
Name:
BDBM50303252
Synonyms:
(1S,3'R,4'S,5'S,6'R)-5-chloro-6-(4-fluoro-2-methylbenzyl)-6'-(hydroxymethyl)-3',4',5',6'-tetrahydro-3H-spiro[isobenzofuran-1,2'-pyran]-3',4',5'-triol | CHEMBL565391
Type:
Small organic molecule
Emp. Form.:
C21H22ClFO6
Mol. Mass.:
424.847
SMILES:
Cc1cc(F)ccc1Cc1cc2c(CO[C@]22O[C@H](CO)[C@@H](O)[C@H](O)[C@H]2O)cc1Cl
: