Target
Sodium/glucose cotransporter 2
Ligand
BDBM50303241
Substrate
Meas. Tech.
ChEMBL_595350 (CHEMBL1050643)
IC50
71±n/a nM
Citation
 Lv, BXu, BFeng, YPeng, KXu, GDu, JZhang, LZhang, WZhang, TZhu, LDing, HSheng, ZWelihinda, ASeed, BChen, Y Exploration of O-spiroketal C-arylglucosides as novel and selective renal sodium-dependent glucose co-transporter 2 (SGLT2) inhibitors. Bioorg Med Chem Lett 19:6877-81 (2009)  
Target
Name:
Sodium/glucose cotransporter 2
Synonyms:
Na(+)/glucose cotransporter 2 SGLT2 Sodium-Dependent Glucose Cotransporter 2 (SGLT2) Solute carrier family 5 member 2
Type:
Protein
Mol. Mass.:
72902.00
Organism:
Homo sapiens (Human)
Description:
P31639
Residue:
672
  
Inhibitor
Name:
BDBM50303241
Synonyms:
(1S,3'R,4'S,5'S,6'R)-6-(4-ethoxybenzyl)-6'-(hydroxymethyl)-3',4',5',6'-tetrahydro-3H-spiro[isobenzofuran-1,2'-pyran]-3',4',5'-triol | CHEMBL570868
Type:
Small organic molecule
Emp. Form.:
C22H26O7
Mol. Mass.:
402.4376
SMILES:
CCOc1ccc(Cc2ccc3CO[C@]4(O[C@H](CO)[C@@H](O)[C@H](O)[C@H]4O)c3c2)cc1
: