Target
Sodium/glucose cotransporter 2
Ligand
BDBM50303246
Substrate
Meas. Tech.
ChEMBL_595350 (CHEMBL1050643)
IC50
0.3±n/a nM
Citation
 Lv, BXu, BFeng, YPeng, KXu, GDu, JZhang, LZhang, WZhang, TZhu, LDing, HSheng, ZWelihinda, ASeed, BChen, Y Exploration of O-spiroketal C-arylglucosides as novel and selective renal sodium-dependent glucose co-transporter 2 (SGLT2) inhibitors. Bioorg Med Chem Lett 19:6877-81 (2009)  
Target
Name:
Sodium/glucose cotransporter 2
Synonyms:
Na(+)/glucose cotransporter 2 SGLT2 Sodium-Dependent Glucose Cotransporter 2 (SGLT2) Solute carrier family 5 member 2
Type:
Protein
Mol. Mass.:
72902.00
Organism:
Homo sapiens (Human)
Description:
P31639
Residue:
672
  
Inhibitor
Name:
BDBM50303246
Synonyms:
(1S,3'R,4'S,5'S,6'R)-5-chloro-6'-(hydroxymethyl)-6-(4-(trifluoromethoxy)benzyl)-3',4',5',6'-tetrahydro-3H-spiro[isobenzofuran-1,2'-pyran]-3',4',5'-triol | CHEMBL565781
Type:
Small organic molecule
Emp. Form.:
C21H20ClF3O7
Mol. Mass.:
476.828
SMILES:
OC[C@H]1O[C@]2(OCc3cc(Cl)c(Cc4ccc(OC(F)(F)F)cc4)cc23)[C@H](O)[C@@H](O)[C@@H]1O
: