Target
Angiotensin-converting enzyme
Ligand
BDBM50303328
Substrate
Meas. Tech.
ChEMBL_595728 (CHEMBL1045251)
Ki
340±n/a nM
Citation
 Jullien, NMakritis, AGeorgiadis, DBeau, FYiotakis, ADive, V Phosphinic tripeptides as dual angiotensin-converting enzyme C-domain and endothelin-converting enzyme-1 inhibitors. J Med Chem 53:208-20 (2010)  
Target
Name:
Angiotensin-converting enzyme
Synonyms:
ACE Angiotensin converting enzyme (ACE) Angiotensin-converting enzyme, soluble form CD_antigen=CD143 DCP1 Kininase II
Type:
Enzyme
Mol. Mass.:
149709.01
Organism:
Homo sapiens (Human)
Description:
Residue:
1306
  
Inhibitor
Name:
BDBM50303328
Synonyms:
(2S)-2-({3-[Hydroxyl(2-phenyl-(1R)-1{[(benzyloxy)carbonyl]amino}ethyl)Phosphinyl]-(2S)-2-[(3-phenylisoxazol-5-yl)methyl]-1-oxopropyl}amino)-3-phenyl Propanoic Acid | CHEMBL567628
Type:
Small organic molecule
Emp. Form.:
C38H38N3O8P
Mol. Mass.:
695.6974
SMILES:
OC(=O)[C@H](Cc1ccccc1)NC(=O)[C@@H](Cc1cc(no1)-c1ccccc1)CP(O)(=O)[C@H](Cc1ccccc1)NC(=O)OCc1ccccc1
: