Target
Neprilysin
Ligand
BDBM50303325
Substrate
Meas. Tech.
ChEMBL_595725 (CHEMBL1045248)
Ki
85±n/a nM
Citation
 Jullien, NMakritis, AGeorgiadis, DBeau, FYiotakis, ADive, V Phosphinic tripeptides as dual angiotensin-converting enzyme C-domain and endothelin-converting enzyme-1 inhibitors. J Med Chem 53:208-20 (2010)  
Target
Name:
Neprilysin
Synonyms:
Atriopeptidase CD_antigen=CD10 EPN MME NEP_HUMAN Neutral endopeptidase | Neutral endopeptidase 24.11
Type:
Enzyme
Mol. Mass.:
85505.38
Organism:
Homo sapiens (Human)
Description:
P08473
Residue:
750
  
Inhibitor
Name:
BDBM50303325
Synonyms:
(2S)-2-{[3-(4',5'-Dihydro-3'-phenyl-5'-isoxazolyl)-2-{[hydroxyl-(2-phenyl-(1R)-1-{[(benzyloxy)carbonyl]amino}ethyl)phosphinyl]-methyl}-1-oxopropyl]amino}Propanoic Acid | CHEMBL570811
Type:
Small organic molecule
Emp. Form.:
C32H36N3O8P
Mol. Mass.:
621.6173
SMILES:
C[C@H](NC(=O)C(CC1CC(=NO1)c1ccccc1)CP(O)(=O)[C@H](Cc1ccccc1)NC(=O)OCc1ccccc1)C(O)=O
: