Target
Endothelin-converting enzyme 1
Ligand
BDBM50303321
Substrate
Meas. Tech.
ChEMBL_595726 (CHEMBL1045249)
Ki
240±n/a nM
Citation
 Jullien, NMakritis, AGeorgiadis, DBeau, FYiotakis, ADive, V Phosphinic tripeptides as dual angiotensin-converting enzyme C-domain and endothelin-converting enzyme-1 inhibitors. J Med Chem 53:208-20 (2010)  
Target
Name:
Endothelin-converting enzyme 1
Synonyms:
ECE-1 ECE1_HUMAN Endothelin-converting enzyme 1 (ECE1)
Type:
Enzyme
Mol. Mass.:
87155.11
Organism:
Homo sapiens (Human)
Description:
P42892
Residue:
770
  
Inhibitor
Name:
BDBM50303321
Synonyms:
(2S)-2-({3-[Hydroxyl(2-phenyl-(1R)-1-{[(benzyloxy)carbonyl]-amino}ethyl)phosphinyl]-(2S)-2-[(3-phenylisoxazol-5-yl)methyl]-1-oxopropyl}amino)-3-phenyl Propanoic Acid | CHEMBL570718
Type:
Small organic molecule
Emp. Form.:
C38H38N3O8P
Mol. Mass.:
695.6974
SMILES:
OC(=O)[C@H](Cc1ccccc1)NC(=O)[C@H](Cc1cc(no1)-c1ccccc1)CP(O)(=O)[C@H](Cc1ccccc1)NC(=O)OCc1ccccc1
: