Target
Proprotein convertase subtilisin/kexin type 6
Ligand
BDBM50303776
Substrate
Meas. Tech.
ChEMBL_597564 (CHEMBL1049701)
Ki
3±n/a nM
Citation
 Becker, GLSielaff, FThan, MELindberg, IRouthier, SDay, RLu, YGarten, WSteinmetzer, T Potent inhibitors of furin and furin-like proprotein convertases containing decarboxylated P1 arginine mimetics. J Med Chem 53:1067-75 (2010)  
Target
Name:
Proprotein convertase subtilisin/kexin type 6
Synonyms:
PACE4 PCSK6_HUMAN | Subtilisin/kexin type 6
Type:
PROTEIN
Mol. Mass.:
106442.22
Organism:
Homo sapiens (Human)
Description:
ChEMBL_1290742
Residue:
969
  
Inhibitor
Name:
BDBM50303776
Synonyms:
CHEMBL568525 | N-((6S,9S,12S)-1,17-diamino-6-(4-carbamimidoylbenzylcarbamoyl)-1,17-diimino-9-isopropyl-8,11-dioxo-2,7,10,16-tetraazaheptadecan-12-yl)decanamide
Type:
Small organic molecule
Emp. Form.:
C35H62N12O4
Mol. Mass.:
714.9448
SMILES:
[#6]-[#6]-[#6]-[#6]-[#6]-[#6]-[#6]-[#6]-[#6]-[#6](=O)-[#7]-[#6@@H](-[#6]-[#6]-[#6]\[#7]=[#6](/[#7])-[#7])-[#6](=O)-[#7]-[#6@@H](-[#6](-[#6])-[#6])-[#6](=O)-[#7]-[#6@@H](-[#6]-[#6]-[#6]\[#7]=[#6](/[#7])-[#7])-[#6](=O)-[#7]-[#6]-c1ccc(cc1)-[#6](-[#7])=[#7]
: