Target
Neuroendocrine convertase 2
Ligand
BDBM50303775
Substrate
Meas. Tech.
ChEMBL_597568 (CHEMBL1049705)
Ki
1388±n/a nM
Citation
 Becker, GLSielaff, FThan, MELindberg, IRouthier, SDay, RLu, YGarten, WSteinmetzer, T Potent inhibitors of furin and furin-like proprotein convertases containing decarboxylated P1 arginine mimetics. J Med Chem 53:1067-75 (2010)  
Target
Name:
Neuroendocrine convertase 2
Synonyms:
KEX2-like endoprotease 2 NEC2 Neuroendocrine convertase 2 PCSK2 Proprotein convertase 2
Type:
PROTEIN
Mol. Mass.:
70563.93
Organism:
Homo sapiens (Human)
Description:
ChEMBL_1290738
Residue:
638
  
Inhibitor
Name:
BDBM50303775
Synonyms:
(S)-2-acetamido-N-((S)-1-((S)-1-(4-carbamimidoylbenzylamino)-5-guanidino-1-oxopentan-2-ylamino)-3-methyl-1-oxobutan-2-yl)-5-guanidinopentanamide | CHEMBL569918
Type:
Small organic molecule
Emp. Form.:
C27H46N12O4
Mol. Mass.:
602.7321
SMILES:
[#6]-[#6](-[#6])-[#6@H](-[#7]-[#6](=O)-[#6@H](-[#6]-[#6]-[#6]\[#7]=[#6](/[#7])-[#7])-[#7]-[#6](-[#6])=O)-[#6](=O)-[#7]-[#6@@H](-[#6]-[#6]-[#6]\[#7]=[#6](/[#7])-[#7])-[#6](=O)-[#7]-[#6]-c1ccc(cc1)-[#6](-[#7])=[#7]
: