Target
Furin
Ligand
BDBM50303779
Substrate
Meas. Tech.
ChEMBL_597562 (CHEMBL1049699)
Ki
2730±n/a nM
Citation
 Becker, GLSielaff, FThan, MELindberg, IRouthier, SDay, RLu, YGarten, WSteinmetzer, T Potent inhibitors of furin and furin-like proprotein convertases containing decarboxylated P1 arginine mimetics. J Med Chem 53:1067-75 (2010)  
Target
Name:
Furin
Synonyms:
FUR FURIN_HUMAN PACE | PCSK3
Type:
Enzyme Catalytic Domain
Mol. Mass.:
86676.01
Organism:
Homo sapiens (Human)
Description:
P09958
Residue:
794
  
Inhibitor
Name:
BDBM50303779
Synonyms:
(S)-5-guanidino-N-((S)-1-((S)-5-guanidino-1-(3-(guanidinomethyl)benzylamino)-1-oxopentan-2-ylamino)-3-methyl-1-oxobutan-2-yl)-2-(2-phenylacetamido)pentanamide | CHEMBL566347
Type:
Small organic molecule
Emp. Form.:
C34H53N13O4
Mol. Mass.:
707.8693
SMILES:
[#6]-[#6](-[#6])-[#6@H](-[#7]-[#6](=O)-[#6@H](-[#6]-[#6]-[#6]\[#7]=[#6](/[#7])-[#7])-[#7]-[#6](=O)-[#6]-c1ccccc1)-[#6](=O)-[#7]-[#6@@H](-[#6]-[#6]-[#6]\[#7]=[#6](/[#7])-[#7])-[#6](=O)-[#7]-[#6]-c1cccc(-[#6]\[#7]=[#6](\[#7])-[#7])c1
: