Target
Mu-type opioid receptor
Ligand
BDBM50304076
Substrate
Meas. Tech.
ChEMBL_601678 (CHEMBL1049576)
IC50
>10000±n/a nM
Citation
 Peng, YZhang, QArora, SKeenan, SMKortagere, SWannemacher, KMHowells, RDWelsh, WJ Novel delta opioid receptor agonists exhibit differential stimulation of signaling pathways. Bioorg Med Chem 17:6442-50 (2009)  
Target
Name:
Mu-type opioid receptor
Synonyms:
M-OR-1 Mor OPRM_MOUSE Oprm | Oprm1
Type:
Enzyme Catalytic Domain
Mol. Mass.:
44431.62
Organism:
MOUSE
Description:
OPIATE Mu OPRM1 MOUSE::P42866
Residue:
398
  
Inhibitor
Name:
BDBM50304076
Synonyms:
3-(2-(4-tert-Butylphenyl)-5-((dimethylamino)methyl)-2H-1,2,4-triazol-3-yl)phenol | CHEMBL593613
Type:
Small organic molecule
Emp. Form.:
C21H26N4O
Mol. Mass.:
350.4573
SMILES:
CN(C)Cc1nc(-c2cccc(O)c2)n(n1)-c1ccc(cc1)C(C)(C)C
: