Target
Delta-type opioid receptor
Ligand
BDBM50304079
Substrate
Meas. Tech.
ChEMBL_601677 (CHEMBL1049575)
IC50
>10000±n/a nM
Citation
 Peng, YZhang, QArora, SKeenan, SMKortagere, SWannemacher, KMHowells, RDWelsh, WJ Novel delta opioid receptor agonists exhibit differential stimulation of signaling pathways. Bioorg Med Chem 17:6442-50 (2009)  
Target
Name:
Delta-type opioid receptor
Synonyms:
DOR-1 MSL-2 OPRD_MOUSE Oprd1
Type:
Enzyme Catalytic Domain
Mol. Mass.:
40577.25
Organism:
MOUSE
Description:
P32300
Residue:
372
  
Inhibitor
Name:
BDBM50304079
Synonyms:
(5-(2,4-Dimethylphenyl)-1-(3-methoxyphenyl)-1H-1,2,4-triazol-3-yl)-N,N-dimethylmethanamine | CHEMBL611957
Type:
Small organic molecule
Emp. Form.:
C20H24N4O
Mol. Mass.:
336.4308
SMILES:
COc1cccc(c1)-n1nc(CN(C)C)nc1-c1ccc(C)cc1C
: