Target
Kappa-type opioid receptor
Ligand
BDBM50304081
Substrate
Meas. Tech.
ChEMBL_601679 (CHEMBL1049577)
IC50
>10000±n/a nM
Citation
 Peng, YZhang, QArora, SKeenan, SMKortagere, SWannemacher, KMHowells, RDWelsh, WJ Novel delta opioid receptor agonists exhibit differential stimulation of signaling pathways. Bioorg Med Chem 17:6442-50 (2009)  
Target
Name:
Kappa-type opioid receptor
Synonyms:
KOR-1 OPIATE Kappa Opioid receptor Ror-d
Type:
G Protein-Coupled Receptor (GPCR)
Mol. Mass.:
42692.90
Organism:
Rattus norvegicus (rat)
Description:
P34975
Residue:
380
  
Inhibitor
Name:
BDBM50304081
Synonyms:
(5-(3-tert-Butylphenyl)-1-(3-methoxyphenyl)-1H-1,2,4-triazol-3-yl)-N,N-dimethylmethanamine | CHEMBL605307
Type:
Small organic molecule
Emp. Form.:
C22H28N4O
Mol. Mass.:
364.4839
SMILES:
COc1cccc(c1)-n1nc(CN(C)C)nc1-c1cccc(c1)C(C)(C)C
: