Target
Mu-type opioid receptor
Ligand
BDBM50304083
Substrate
Meas. Tech.
ChEMBL_601678 (CHEMBL1049576)
IC50
2435±n/a nM
Citation
 Peng, YZhang, QArora, SKeenan, SMKortagere, SWannemacher, KMHowells, RDWelsh, WJ Novel delta opioid receptor agonists exhibit differential stimulation of signaling pathways. Bioorg Med Chem 17:6442-50 (2009)  
Target
Name:
Mu-type opioid receptor
Synonyms:
M-OR-1 Mor OPRM_MOUSE Oprm | Oprm1
Type:
Enzyme Catalytic Domain
Mol. Mass.:
44431.62
Organism:
MOUSE
Description:
OPIATE Mu OPRM1 MOUSE::P42866
Residue:
398
  
Inhibitor
Name:
BDBM50304083
Synonyms:
3-(3-((Dimethylamino)methyl)-5-(2,4-dimethylphenyl)-1H-1,2,4-triazol-1-yl)phenol | CHEMBL596371
Type:
Small organic molecule
Emp. Form.:
C19H22N4O
Mol. Mass.:
322.4042
SMILES:
CN(C)Cc1nc(-c2ccc(C)cc2C)n(n1)-c1cccc(O)c1
: