Target
Amine oxidase [flavin-containing] A
Ligand
BDBM50304156
Substrate
Meas. Tech.
ChEMBL_601025 (CHEMBL1069162)
Ki
4.22±n/a nM
Citation
 Gökhan-Kelekçi, NSimsek, OOErcan, AYelekçi, KSahin, ZSIsik, SUçar, GBilgin, AA Synthesis and molecular modeling of some novel hexahydroindazole derivatives as potent monoamine oxidase inhibitors. Bioorg Med Chem 17:6761-72 (2009)  
Target
Name:
Amine oxidase [flavin-containing] A
Synonyms:
AOFA_RAT Amine oxidase [flavin-containing] A Monoamine Oxidase Type A (MAO-A) Monoamine oxidase A (MAO-A) Monoamine oxidase type A (MAOA)
Type:
Enzyme
Mol. Mass.:
59515.21
Organism:
Rattus norvegicus (rat)
Description:
Residue:
526
  
Inhibitor
Name:
BDBM50304156
Synonyms:
3-(2-Furyl)-2-(N-phenyllthiocarbamoyl)-3,3a,4,5,6,7-hexahydro-2H-indazol | CHEMBL594029
Type:
Small organic molecule
Emp. Form.:
C18H19N3OS
Mol. Mass.:
325.428
SMILES:
S=C(Nc1ccccc1)N1N=C2CCCCC2C1c1ccco1
: