Target
Amine oxidase [flavin-containing] B
Ligand
BDBM50304156
Substrate
Meas. Tech.
ChEMBL_601026 (CHEMBL1069163)
IC50
80450±n/a nM
Citation
 Gökhan-Kelekçi, NSimsek, OOErcan, AYelekçi, KSahin, ZSIsik, SUçar, GBilgin, AA Synthesis and molecular modeling of some novel hexahydroindazole derivatives as potent monoamine oxidase inhibitors. Bioorg Med Chem 17:6761-72 (2009)  
Target
Name:
Amine oxidase [flavin-containing] B
Synonyms:
AOFB_RAT Amine oxidase [flavin-containing] B Monoamine Oxidase Type B (MAO-B) Monoamine oxidase B (MAO-B) Monoamine oxidase type B (MAOB) | Monoamine oxidase-B (MAO-B)
Type:
Enzyme
Mol. Mass.:
58469.65
Organism:
Rattus norvegicus (rat)
Description:
P19643
Residue:
520
  
Inhibitor
Name:
BDBM50304156
Synonyms:
3-(2-Furyl)-2-(N-phenyllthiocarbamoyl)-3,3a,4,5,6,7-hexahydro-2H-indazol | CHEMBL594029
Type:
Small organic molecule
Emp. Form.:
C18H19N3OS
Mol. Mass.:
325.428
SMILES:
S=C(Nc1ccccc1)N1N=C2CCCCC2C1c1ccco1
: