Target
Amine oxidase [flavin-containing] B
Ligand
BDBM15613
Substrate
Meas. Tech.
ChEMBL_601026 (CHEMBL1069163)
Ki
1080±n/a nM
Citation
 Gökhan-Kelekçi, NSimsek, OOErcan, AYelekçi, KSahin, ZSIsik, SUçar, GBilgin, AA Synthesis and molecular modeling of some novel hexahydroindazole derivatives as potent monoamine oxidase inhibitors. Bioorg Med Chem 17:6761-72 (2009)  
Target
Name:
Amine oxidase [flavin-containing] B
Synonyms:
AOFB_RAT Amine oxidase [flavin-containing] B Monoamine Oxidase Type B (MAO-B) Monoamine oxidase B (MAO-B) Monoamine oxidase type B (MAOB) | Monoamine oxidase-B (MAO-B)
Type:
Enzyme
Mol. Mass.:
58469.65
Organism:
Rattus norvegicus (rat)
Description:
P19643
Residue:
520
  
Inhibitor
Name:
BDBM15613
Synonyms:
4-chloro-N-(2-morpholin-4-ylethyl)benzamide Aurorix MCL | Moclobemide
Type:
Small organic molecule
Emp. Form.:
C13H17ClN2O2
Mol. Mass.:
268.739
SMILES:
Clc1ccc(cc1)C(=O)NCCN1CCOCC1
: