Target
Lysophosphatidic acid receptor 3
Ligand
BDBM50271625
Substrate
Meas. Tech.
ChEMBL_605121 (CHEMBL1073935)
IC50
24±n/a nM
Citation
 Fells, JITsukahara, RLiu, JTigyi, GParrill, AL Structure-based drug design identifies novel LPA3 antagonists. Bioorg Med Chem 17:7457-64 (2009)  
Target
Name:
Lysophosphatidic acid receptor 3
Synonyms:
EDG7 LPAR3 Lysophosphatidic acid receptor 1/3 Lysophosphatidic acid receptor Edg-7
Type:
Enzyme
Mol. Mass.:
40149.72
Organism:
Homo sapiens (Human)
Description:
Q9UBY5
Residue:
353
  
Inhibitor
Name:
BDBM50271625
Synonyms:
2-(2-(2-aminoacetamido)-3-(2,4-dinitrophenylthio)propanamido)pentanedioic acid | CHEMBL482887
Type:
Small organic molecule
Emp. Form.:
C16H19N5O10S
Mol. Mass.:
473.415
SMILES:
NCC(=O)NC(CSc1ccc(cc1[N+]([O-])=O)[N+]([O-])=O)C(=O)NC(CCC(O)=O)C(O)=O
: