Target
Tissue alpha-L-fucosidase
Ligand
BDBM50304626
Substrate
Meas. Tech.
ChEMBL_604167 (CHEMBL1039761)
Ki
1000±n/a nM
Citation
 Pearson, MSFloquet, NBello, CVogel, PPlantier-Royon, RSzymoniak, JBertus, PBehr, JB The spirocyclopropyl moiety as a methyl surrogate in the structure of l-fucosidase and l-rhamnosidase inhibitors. Bioorg Med Chem 17:8020-6 (2009)  
Target
Name:
Tissue alpha-L-fucosidase
Synonyms:
Alpha-L-fucosidase 1 FUCO_BOVIN
Type:
PROTEIN
Mol. Mass.:
54093.12
Organism:
Bos taurus
Description:
ChEMBL_335897
Residue:
468
  
Inhibitor
Name:
BDBM50304626
Synonyms:
(2R,3S,4S,5S)-2-methylpiperidine-3,4,5-triol | CHEMBL593715
Type:
Small organic molecule
Emp. Form.:
C6H13NO3
Mol. Mass.:
147.1723
SMILES:
C[C@H]1NC[C@H](O)[C@H](O)[C@H]1O
: