Target
TGF-beta receptor type-1
Ligand
BDBM50304853
Substrate
Meas. Tech.
ChEMBL_606317 (CHEMBL1070009)
IC50
1400±n/a nM
Citation
 Guckian, KCarter, MBLin, EYChoi, MSun, LBoriack-Sjodin, PAChuaqui, CLane, BCheung, KLing, LLee, WC Pyrazolone based TGFbetaR1 kinase inhibitors. Bioorg Med Chem Lett 20:326-9 (2010)  
Target
Name:
TGF-beta receptor type-1
Synonyms:
ALK-5 Activin A receptor type II-like protein kinase of 53kD SKR4 TGF-beta receptor type I TGFBR1 TGFR1_HUMAN Transforming growth factor-beta receptor type I
Type:
enzyme
Mol. Mass.:
55968.24
Organism:
Homo sapiens (Human)
Description:
P36897
Residue:
503
  
Inhibitor
Name:
BDBM50304853
Synonyms:
4-(3-methoxyphenyl)-1,2-dimethyl-5-(quinoxalin-6-yl)-1H-pyrazol-3(2H)-one | CHEMBL606376
Type:
Small organic molecule
Emp. Form.:
C20H18N4O2
Mol. Mass.:
346.3825
SMILES:
COc1cccc(c1)-c1c(-c2ccc3nccnc3c2)n(C)n(C)c1=O
: