Target
TGF-beta receptor type-1
Ligand
BDBM50304865
Substrate
Meas. Tech.
ChEMBL_606316 (CHEMBL1070008)
Ki
19±n/a nM
Citation
 Guckian, KCarter, MBLin, EYChoi, MSun, LBoriack-Sjodin, PAChuaqui, CLane, BCheung, KLing, LLee, WC Pyrazolone based TGFbetaR1 kinase inhibitors. Bioorg Med Chem Lett 20:326-9 (2010)  
Target
Name:
TGF-beta receptor type-1
Synonyms:
ALK-5 Activin A receptor type II-like protein kinase of 53kD SKR4 TGF-beta receptor type I TGFBR1 TGFR1_HUMAN Transforming growth factor-beta receptor type I
Type:
enzyme
Mol. Mass.:
55968.24
Organism:
Homo sapiens (Human)
Description:
P36897
Residue:
503
  
Inhibitor
Name:
BDBM50304865
Synonyms:
CHEMBL607429 | N-(3-(1,2-dimethyl-3-oxo-5-(quinoxalin-6-yl)-2,3-dihydro-1H-pyrazol-4-yl)phenyl)methanesulfonamide
Type:
Small organic molecule
Emp. Form.:
C20H19N5O3S
Mol. Mass.:
409.462
SMILES:
Cn1c(c(-c2cccc(NS(C)(=O)=O)c2)c(=O)n1C)-c1ccc2nccnc2c1
: