Target
Tyrosine-protein kinase JAK2
Ligand
BDBM50305157
Substrate
Meas. Tech.
ChEMBL_603293 (CHEMBL1049517)
Ki
0.8±n/a nM
Citation
 Wang, TLedeboer, MWDuffy, JPSalituro, FGPierce, ACZuccola, HJBlock, EShlyakter, DHogan, JKBennani, YL A novel chemotype of kinase inhibitors: Discovery of 3,4-ring fused 7-azaindoles and deazapurines as potent JAK2 inhibitors. Bioorg Med Chem Lett 20:153-6 (2010)  
Target
Name:
Tyrosine-protein kinase JAK2
Synonyms:
JAK-2 JAK2_HUMAN Janus kinase 2 (JAK2) | Janus kinase 2 (a protein tyrosine kinase)
Type:
Protein
Mol. Mass.:
130684.68
Organism:
Homo sapiens (Human)
Description:
O60674
Residue:
1132
  
Inhibitor
Name:
BDBM50305157
Synonyms:
3-chloro-4-{8,12,14,16-tetraazatetracyclo[8.6.1.0^{2,7}.0^{13,17}]heptadeca-1(17),2(7),3,5,8,10,13,15-octaen-9-yl}phenol | CHEMBL603048
Type:
Small organic molecule
Emp. Form.:
C19H11ClN4O
Mol. Mass.:
346.77
SMILES:
Oc1ccc(c(Cl)c1)-c1nc2ccccc2c2ncnc3[nH]cc1c23
: