Target
Carboxypeptidase B2
Ligand
BDBM50305349
Substrate
Meas. Tech.
ChEMBL_603568 (CHEMBL1069123)
Ki
15±n/a nM
Citation
 Owen, DRBull, DJBunnage, MEGlossop, MSMaguire, RJStrang, RS Oxygenated analogues of UK-396082 as inhibitors of activated thrombin activatable fibrinolysis inhibitor. Bioorg Med Chem Lett 20:92-6 (2010)  
Target
Name:
Carboxypeptidase B2
Synonyms:
CBPB2_HUMAN CPU Carboxypeptidase B2 isoform A Plasma carboxypeptidase B Thrombin-activable fibrinolysis inhibitor | pCPB
Type:
Enzyme
Mol. Mass.:
48432.74
Organism:
Homo sapiens (Human)
Description:
Q96IY4
Residue:
423
  
Inhibitor
Name:
BDBM50305349
Synonyms:
(+/-)-2-(2-aminoethoxy)-3-(1-butyl-1H-imidazol-4-yl)propanoic acid | CHEMBL590859
Type:
Small organic molecule
Emp. Form.:
C12H21N3O3
Mol. Mass.:
255.3134
SMILES:
CCCCn1cnc(CC(OCCN)C(O)=O)c1
: