Target
Carboxypeptidase B2
Ligand
BDBM50305352
Substrate
Meas. Tech.
ChEMBL_603568 (CHEMBL1069123)
Ki
7.5±n/a nM
Citation
 Owen, DRBull, DJBunnage, MEGlossop, MSMaguire, RJStrang, RS Oxygenated analogues of UK-396082 as inhibitors of activated thrombin activatable fibrinolysis inhibitor. Bioorg Med Chem Lett 20:92-6 (2010)  
Target
Name:
Carboxypeptidase B2
Synonyms:
CBPB2_HUMAN CPU Carboxypeptidase B2 isoform A Plasma carboxypeptidase B Thrombin-activable fibrinolysis inhibitor | pCPB
Type:
Enzyme
Mol. Mass.:
48432.74
Organism:
Homo sapiens (Human)
Description:
Q96IY4
Residue:
423
  
Inhibitor
Name:
BDBM50305352
Synonyms:
(S)-2-((R)-1-aminopropan-2-yloxy)-3-(1-phenyl-1H-imidazol-4-yl)propanoic acid | CHEMBL601926
Type:
Small organic molecule
Emp. Form.:
C15H19N3O3
Mol. Mass.:
289.3297
SMILES:
C[C@H](CN)O[C@@H](Cc1cn(cn1)-c1ccccc1)C(O)=O
: