Target
Beta-secretase 1
Ligand
BDBM50305478
Substrate
Meas. Tech.
ChEMBL_603776 (CHEMBL1042914)
IC50
390±n/a nM
Citation
 Nowak, PCole, DCAulabaugh, ABard, JChopra, RCowling, RFan, KYHu, BJacobsen, SJani, MJin, GLo, MCMalamas, MSManas, ESNarasimhan, RReinhart, PRobichaud, AJStock, JRSubrath, JSvenson, KTurner, JWagner, EZhou, PEllingboe, JW Discovery and initial optimization of 5,5'-disubstituted aminohydantoins as potent beta-secretase (BACE1) inhibitors. Bioorg Med Chem Lett 20:632-5 (2010)  
Target
Name:
Beta-secretase 1
Synonyms:
ASP2 Aspartyl protease 2 BACE1 Beta-secretase (BACE) Beta-secretase 1 (BACE 1) Beta-secretase 1 (BACE1) Beta-site amyloid precursor protein cleaving enzyme 1 Memapsin-2 beta-Secretase (BACE-1) | beta-Secretase (BACE1)
Type:
Protein
Mol. Mass.:
55755.10
Organism:
Homo sapiens (Human)
Description:
P56817
Residue:
501
  
Inhibitor
Name:
BDBM50305478
Synonyms:
4-((2-amino-4-cyclohexyl-5-oxo-4-phenyl-4,5-dihydro-1H-imidazol-1-yl)methyl)cyclohexanecarboxylic acid | CHEMBL589891
Type:
Small organic molecule
Emp. Form.:
C23H31N3O3
Mol. Mass.:
397.5105
SMILES:
NC1=NC(C2CCCCC2)(C(=O)N1C[C@H]1CC[C@@H](CC1)C(O)=O)c1ccccc1
: