Target
Beta-secretase 2
Ligand
BDBM50305474
Substrate
Meas. Tech.
ChEMBL_603777 (CHEMBL1042915)
IC50
490±n/a nM
Citation
 Nowak, PCole, DCAulabaugh, ABard, JChopra, RCowling, RFan, KYHu, BJacobsen, SJani, MJin, GLo, MCMalamas, MSManas, ESNarasimhan, RReinhart, PRobichaud, AJStock, JRSubrath, JSvenson, KTurner, JWagner, EZhou, PEllingboe, JW Discovery and initial optimization of 5,5'-disubstituted aminohydantoins as potent beta-secretase (BACE1) inhibitors. Bioorg Med Chem Lett 20:632-5 (2010)  
Target
Name:
Beta-secretase 2
Synonyms:
AEPLC ASP1 Asp 1 Aspartyl protease 1 BACE2_HUMAN Beta-secretase (BACE) Beta-secretase 2 (BACE-2) Beta-site APP-cleaving enzyme 2 Memapsin-1 beta-Secretase (BACE-2)
Type:
Protein
Mol. Mass.:
56171.20
Organism:
Homo sapiens (Human)
Description:
Q9Y5Z0
Residue:
518
  
Inhibitor
Name:
BDBM50305474
Synonyms:
CHEMBL594896 | N-(3-(2-amino-4-cyclohexyl-1-methyl-5-oxo-4,5-dihydro-1H-imidazol-4-yl)phenyl)-3-methoxybenzamide
Type:
Small organic molecule
Emp. Form.:
C24H28N4O3
Mol. Mass.:
420.5041
SMILES:
COc1cccc(c1)C(=O)Nc1cccc(c1)C1(N=C(N)N(C)C1=O)C1CCCCC1
: