Target
Beta-secretase 2
Ligand
BDBM50305475
Substrate
Meas. Tech.
ChEMBL_603777 (CHEMBL1042915)
IC50
1150±n/a nM
Citation
 Nowak, PCole, DCAulabaugh, ABard, JChopra, RCowling, RFan, KYHu, BJacobsen, SJani, MJin, GLo, MCMalamas, MSManas, ESNarasimhan, RReinhart, PRobichaud, AJStock, JRSubrath, JSvenson, KTurner, JWagner, EZhou, PEllingboe, JW Discovery and initial optimization of 5,5'-disubstituted aminohydantoins as potent beta-secretase (BACE1) inhibitors. Bioorg Med Chem Lett 20:632-5 (2010)  
Target
Name:
Beta-secretase 2
Synonyms:
AEPLC ASP1 Asp 1 Aspartyl protease 1 BACE2_HUMAN Beta-secretase (BACE) Beta-secretase 2 (BACE-2) Beta-site APP-cleaving enzyme 2 Memapsin-1 beta-Secretase (BACE-2)
Type:
Protein
Mol. Mass.:
56171.20
Organism:
Homo sapiens (Human)
Description:
Q9Y5Z0
Residue:
518
  
Inhibitor
Name:
BDBM50305475
Synonyms:
CHEMBL605518 | N-(3-(2-amino-4-cyclohexyl-1-methyl-5-oxo-4,5-dihydro-1H-imidazol-4-yl)phenyl)benzo[d][1,3]dioxole-5-carboxamide
Type:
Small organic molecule
Emp. Form.:
C24H26N4O4
Mol. Mass.:
434.4876
SMILES:
CN1C(N)=NC(C2CCCCC2)(C1=O)c1cccc(NC(=O)c2ccc3OCOc3c2)c1
: