Target
Acyl-CoA desaturase 1
Ligand
BDBM50305774
Substrate
Meas. Tech.
ChEMBL_604760 (CHEMBL1072554)
IC50
6±n/a nM
Citation
 Léger, SBlack, WCDeschenes, DDolman, SFalgueyret, JPGagnon, MGuiral, SHuang, ZGuay, JLeblanc, YLi, CSMassé, FOballa, RZhang, L Synthesis and biological activity of a potent and orally bioavailable SCD inhibitor (MF-438). Bioorg Med Chem Lett 20:499-502 (2010)  
Target
Name:
Acyl-CoA desaturase 1
Synonyms:
ACOD1_RAT Scd Stearoyl-CoA desaturase 1 (SCD1)
Type:
Enzyme
Mol. Mass.:
41485.97
Organism:
Rattus norvegicus (Rat)
Description:
P07308
Residue:
358
  
Inhibitor
Name:
BDBM50305774
Synonyms:
2-methyl-5-(6-(4-(2-(trifluoromethyl)phenoxy)piperidin-1-yl)pyridazin-3-yl)-1,3,4-oxadiazole | CHEMBL603957
Type:
Small organic molecule
Emp. Form.:
C19H18F3N5O2
Mol. Mass.:
405.3737
SMILES:
Cc1nnc(o1)-c1ccc(nn1)N1CCC(CC1)Oc1ccccc1C(F)(F)F
: