Target
Collagenase 3
Ligand
BDBM50305830
Substrate
Meas. Tech.
ChEMBL_605223 (CHEMBL1069934)
Ki
76±n/a nM
Citation
 Schnute, MEO'Brien, PMNahra, JMorris, MHoward Roark, WHanau, CERuminski, PGScholten, JAFletcher, TRHamper, BCCarroll, JNPatt, WCShieh, HSCollins, BPavlovsky, AGPalmquist, KEAston, KWHitchcock, JRogers, MDMcDonald, JJohnson, ARMunie, GEWittwer, AJMan, CFSettle, SLNemirovskiy, OVickery, LEAgawal, ADyer, RDSunyer, T Discovery of (pyridin-4-yl)-2H-tetrazole as a novel scaffold to identify highly selective matrix metalloproteinase-13 inhibitors for the treatment of osteoarthritis. Bioorg Med Chem Lett 20:576-80 (2010)  
Target
Name:
Collagenase 3
Synonyms:
MMP-13 MMP13_HUMAN Matrix metalloproteinase-13 (MMP-13) | Matrix metalloproteinase-13 (MMP13)
Type:
Enzyme
Mol. Mass.:
53808.06
Organism:
Homo sapiens (Human)
Description:
P45452
Residue:
471
  
Inhibitor
Name:
BDBM50305830
Synonyms:
4-((5-(2-(3-fluorobenzylcarbamoyl)pyridin-4-yl)-2H-tetrazol-2-yl)methyl)benzoic acid CHEMBL593034
Type:
Small organic molecule
Emp. Form.:
C22H17FN6O3
Mol. Mass.:
432.4072
SMILES:
OC(=O)c1ccc(Cn2nnc(n2)-c2ccnc(c2)C(=O)NCc2cccc(F)c2)cc1
: