Target
Interstitial collagenase
Ligand
BDBM50305842
Substrate
Meas. Tech.
ChEMBL_605225 (CHEMBL1069305)
Ki
>25000±n/a nM
Citation
 Schnute, MEO'Brien, PMNahra, JMorris, MHoward Roark, WHanau, CERuminski, PGScholten, JAFletcher, TRHamper, BCCarroll, JNPatt, WCShieh, HSCollins, BPavlovsky, AGPalmquist, KEAston, KWHitchcock, JRogers, MDMcDonald, JJohnson, ARMunie, GEWittwer, AJMan, CFSettle, SLNemirovskiy, OVickery, LEAgawal, ADyer, RDSunyer, T Discovery of (pyridin-4-yl)-2H-tetrazole as a novel scaffold to identify highly selective matrix metalloproteinase-13 inhibitors for the treatment of osteoarthritis. Bioorg Med Chem Lett 20:576-80 (2010)  
Target
Name:
Interstitial collagenase
Synonyms:
CLG MMP1 Matrix metalloproteinase-1 | Matrix metalloproteinase-1 (MMP-1)
Type:
Enzyme
Mol. Mass.:
54010.26
Organism:
Homo sapiens (Human)
Description:
P03956
Residue:
469
  
Inhibitor
Name:
BDBM50305842
Synonyms:
CHEMBL603656 | trans-4-((5-(2-(4-fluorobenzylcarbamoyl)-6-methylpyridin-4-yl)-2H-tetrazol-2-yl)methyl)cyclohexanecarboxylic acid
Type:
Small organic molecule
Emp. Form.:
C23H25FN6O3
Mol. Mass.:
452.4814
SMILES:
Cc1cc(cc(n1)C(=O)NCc1ccc(F)cc1)-c1nnn(C[C@H]2CC[C@@H](CC2)C(O)=O)n1
: