Target
Oxysterols receptor LXR-beta
Ligand
BDBM50306059
Substrate
Meas. Tech.
ChEMBL_605983 (CHEMBL1069927)
IC50
99±n/a nM
Citation
 Travins, JMBernotas, RCKaufman, DHQuinet, ENambi, PFeingold, IHuselton, CWilhelmsson, AGoos-Nilsson, AWrobel, J 1-(3-Aryloxyaryl)benzimidazole sulfones are liver X receptor agonists. Bioorg Med Chem Lett 20:526-30 (2010)  
Target
Name:
Oxysterols receptor LXR-beta
Synonyms:
LXRB Liver X, LXR beta NR1H2 Nuclear receptor NER Ubiquitously-expressed nuclear receptor
Type:
Enzyme Catalytic Domain
Mol. Mass.:
50978.79
Organism:
Homo sapiens (Human)
Description:
P55055
Residue:
460
  
Inhibitor
Name:
BDBM50306059
Synonyms:
4-chloro-1-(3-(3-(ethylsulfonyl)phenoxy)phenyl)-2-methyl-1H-benzo[d]imidazole | CHEMBL593814
Type:
Small organic molecule
Emp. Form.:
C22H19ClN2O3S
Mol. Mass.:
426.916
SMILES:
CCS(=O)(=O)c1cccc(Oc2cccc(c2)-n2c(C)nc3c(Cl)cccc23)c1
: