Target
Oxysterols receptor LXR-alpha
Ligand
BDBM50306083
Substrate
Meas. Tech.
ChEMBL_605982 (CHEMBL1069926)
IC50
17±n/a nM
Citation
 Travins, JMBernotas, RCKaufman, DHQuinet, ENambi, PFeingold, IHuselton, CWilhelmsson, AGoos-Nilsson, AWrobel, J 1-(3-Aryloxyaryl)benzimidazole sulfones are liver X receptor agonists. Bioorg Med Chem Lett 20:526-30 (2010)  
Target
Name:
Oxysterols receptor LXR-alpha
Synonyms:
LXRA Liver X receptor alpha Liver X receptor alpha (NR1H3) NR1H3 Nuclear orphan receptor LXR-alpha | Nuclear receptor subfamily 1 group H member 3
Type:
Enzyme Catalytic Domain
Mol. Mass.:
50403.85
Organism:
Homo sapiens (Human)
Description:
Q13133
Residue:
447
  
Inhibitor
Name:
BDBM50306083
Synonyms:
4-chloro-1-(2-chloro-5-(3-(trifluoromethylsulfonyl)phenoxy)phenyl)-2-methyl-1H-benzo[d]imidazole | CHEMBL605723
Type:
Small organic molecule
Emp. Form.:
C21H13Cl2F3N2O3S
Mol. Mass.:
501.306
SMILES:
Cc1nc2c(Cl)cccc2n1-c1cc(Oc2cccc(c2)S(=O)(=O)C(F)(F)F)ccc1Cl
: