Target
Cathepsin K
Ligand
BDBM50306304
Substrate
Meas. Tech.
ChEMBL_609281 (CHEMBL1070042)
IC50
0.2±n/a nM
Citation
Target
Name:
Cathepsin K
Synonyms:
CATK_HUMAN CTSO Cathepsin O Cathepsin X
Type:
Enzyme
Mol. Mass.:
36975.68
Organism:
Homo sapiens (Human)
Description:
P43235
Residue:
329
  
Inhibitor
Name:
BDBM50306304
Synonyms:
(S)-N-(1-cyanocyclopropyl)-4-fluoro-4-methyl-2-((S)-2,2,2-trifluoro-1-(4'-(2-hydroxypropan-2-yl)biphenyl-4-yl)ethylamino)pentanamide | CHEMBL597018
Type:
Small organic molecule
Emp. Form.:
C27H31F4N3O2
Mol. Mass.:
505.5476
SMILES:
CC(C)(F)C[C@H](N[C@@H](c1ccc(cc1)-c1ccc(cc1)C(C)(C)O)C(F)(F)F)C(=O)NC1(CC1)C#N
: