Target
Cathepsin K
Ligand
BDBM50306307
Substrate
Meas. Tech.
ChEMBL_609281 (CHEMBL1070042)
IC50
0.2±n/a nM
Citation
Target
Name:
Cathepsin K
Synonyms:
CATK_HUMAN CTSO Cathepsin O Cathepsin X
Type:
Enzyme
Mol. Mass.:
36975.68
Organism:
Homo sapiens (Human)
Description:
P43235
Residue:
329
  
Inhibitor
Name:
BDBM50306307
Synonyms:
(S)-2-((S)-1-(4'-((S)-1-amino-1-oxopropan-2-yl)biphenyl-4-yl)-2,2,2-trifluoroethylamino)-N-(1-cyanocyclopropyl)-4-fluoro-4-methylpentanamide | CHEMBL597426
Type:
Small organic molecule
Emp. Form.:
C27H30F4N4O2
Mol. Mass.:
518.5463
SMILES:
C[C@H](C(N)=O)c1ccc(cc1)-c1ccc(cc1)[C@H](N[C@@H](CC(C)(C)F)C(=O)NC1(CC1)C#N)C(F)(F)F
: